Reaction Details
TargetFocal adhesion kinase 1
LigandBDBM50328255
Substrate/Competitorn/a
Meas. Tech.ChEMBL_665425 (CHEMBL1261154)
IC50 6900±n/a nM
Citation Liu, JJDaniewski, IDing, QHiggins, BJu, GKolinsky, KKonzelmann, FLukacs, CPizzolato, GRossman, PSwain, AThakkar, KWei, CCMiklowski, DYang, HYin, XWovkulich, PM Pyrazolobenzodiazepines: part I. Synthesis and SAR of a potent class of kinase inhibitors. Bioorg Med Chem Lett20:5984-7 (2010) 
 
Focal adhesion kinase 1
Name:Focal adhesion kinase 1
Type:Tyrosine-protein kinase
Mol. Mass.:119233.17
Organism:Homo sapiens (Human)
Description:Q05397
Residue:1052
BDBM50328255
NameBDBM50328255
Synonyms:5-(2-chlorophenyl)-3-methyl-7-nitro-2,10-dihydrobenzo[e]pyrazolo[4,3-b][1,4]diazepine | CHEMBL1258821
TypeSmall organic molecule
Emp. Form.C17H12ClN5O2
Mol. Mass.353.762
SMILESCc1n[nH]c2Nc3ccc(cc3C(=Nc12)c1ccccc1Cl)[N+]([O-])=O