Reaction Details
TargetEphrin type-B receptor 4
LigandBDBM50329055
Substrate/Competitorn/a
Meas. Tech.ChEMBL_674154 (CHEMBL1274251)
IC50 205±n/a nM
Citation Bardelle, CBarlaam, BBrooks, NColeman, TCross, DDucray, RGreen, IBrempt, CLOlivier, ARead, J Inhibitors of the tyrosine kinase EphB4. Part 3: identification of non-benzodioxole-based kinase inhibitors. Bioorg Med Chem Lett20:6242-5 (2010) 
 
Ephrin type-B receptor 4
Name:Ephrin type-B receptor 4
Type:Enzyme
Mol. Mass.:108273.51
Organism:Homo sapiens (Human)
Description:P54760
Residue:987
BDBM50329055
NameBDBM50329055
Synonyms:CHEMBL1270671 | N4-(benzofuran-7-yl)-N2-(3-(methylsulfonyl)phenyl)pyrimidine-2,4-diamine
TypeSmall organic molecule
Emp. Form.C19H16N4O3S
Mol. Mass.380.42
SMILESCS(=O)(=O)c1cccc(Nc2nccc(Nc3cccc4ccoc34)n2)c1