Reaction Details
TargetEphrin type-B receptor 4
LigandBDBM50329064
Substrate/Competitorn/a
Meas. Tech.ChEMBL_674154 (CHEMBL1274251)
IC50 121±n/a nM
Citation Bardelle, CBarlaam, BBrooks, NColeman, TCross, DDucray, RGreen, IBrempt, CLOlivier, ARead, J Inhibitors of the tyrosine kinase EphB4. Part 3: identification of non-benzodioxole-based kinase inhibitors. Bioorg Med Chem Lett20:6242-5 (2010) 
 
Ephrin type-B receptor 4
Name:Ephrin type-B receptor 4
Type:Enzyme
Mol. Mass.:108273.51
Organism:Homo sapiens (Human)
Description:P54760
Residue:987
BDBM50329064
NameBDBM50329064
Synonyms:2-((5-chlorobenzo[d][1,3]dioxol-4-yl)(2-(3-(methylsulfonyl)phenylamino)pyrimidin-4-yl)amino)ethanol | CHEMBL1271186
TypeSmall organic molecule
Emp. Form.C20H19ClN4O5S
Mol. Mass.462.907
SMILESCS(=O)(=O)c1cccc(Nc2nccc(n2)N(CCO)c2c3OCOc3ccc2Cl)c1