Reaction Details
TargetEphrin type-B receptor 4
LigandBDBM50329069
Substrate/Competitorn/a
Meas. Tech.ChEMBL_674154 (CHEMBL1274251)
IC50 36±n/a nM
Citation Bardelle, CBarlaam, BBrooks, NColeman, TCross, DDucray, RGreen, IBrempt, CLOlivier, ARead, J Inhibitors of the tyrosine kinase EphB4. Part 3: identification of non-benzodioxole-based kinase inhibitors. Bioorg Med Chem Lett20:6242-5 (2010) 
 
Ephrin type-B receptor 4
Name:Ephrin type-B receptor 4
Type:Enzyme
Mol. Mass.:108273.51
Organism:Homo sapiens (Human)
Description:P54760
Residue:987
BDBM50329069
NameBDBM50329069
Synonyms:CHEMBL1271394 | N4-(1H-indazol-4-yl)-N4-methyl-N2-(3-(methylsulfonyl)phenyl)pyrimidine-2,4-diamine
TypeSmall organic molecule
Emp. Form.C19H18N6O2S
Mol. Mass.394.45
SMILESCN(c1ccnc(Nc2cccc(c2)S(C)(=O)=O)n1)c1cccc2[nH]ncc12