Reaction Details
TargetEphrin type-B receptor 4
LigandBDBM50329068
Substrate/Competitorn/a
Meas. Tech.ChEMBL_674155 (CHEMBL1274252)
IC50 8600±n/a nM
Citation Bardelle, CBarlaam, BBrooks, NColeman, TCross, DDucray, RGreen, IBrempt, CLOlivier, ARead, J Inhibitors of the tyrosine kinase EphB4. Part 3: identification of non-benzodioxole-based kinase inhibitors. Bioorg Med Chem Lett20:6242-5 (2010) 
 
Ephrin type-B receptor 4
Name:Ephrin type-B receptor 4
Type:Enzyme
Mol. Mass.:108273.51
Organism:Homo sapiens (Human)
Description:P54760
Residue:987
BDBM50329068
NameBDBM50329068
Synonyms:CHEMBL1271393 | N4-(1H-benzo[d][1,2,3]triazol-4-yl)-N2-(3,5-dimorpholinophenyl)pyrimidine-2,4-diamine
TypeSmall organic molecule
Emp. Form.C24H27N9O2
Mol. Mass.473.5303
SMILESC1CN(CCO1)c1cc(Nc2nccc(Nc3cccc4nn[nH]c34)n2)cc(c1)N1CCOCC1