Reaction Details
TargetC-C chemokine receptor type 5
LigandBDBM50331659
Substrate/Competitorn/a
Meas. Tech.ChEMBL_687622 (CHEMBL1290946)
IC50 0.4±n/a nM
Citation Duan, MPeckham, JEdelstein, MFerris, RKazmierski, WMSpaltenstein, AWheelan, PXiong, Z Discovery of N-benzyl-N'-(4-pipyridinyl)urea CCR5 antagonists as anti-HIV-1 agents (I): optimization of the amine portion. Bioorg Med Chem Lett20:7397-400 (2010) 
 
C-C chemokine receptor type 5
Name:C-C chemokine receptor type 5
Type:Enzyme
Mol. Mass.:40540.21
Organism:Homo sapiens (Human)
Description:P51681
Residue:352
BDBM50331659
NameBDBM50331659
Synonyms:CHEMBL1288663 | N-tert-butyl-4-chloro-5-(4-(2-(4-(3-(4-cyanobenzyl)-1-(3-fluorophenyl)ureido)piperidin-1-yl)ethyl)-4-(3-fluorophenyl)piperidine-1-carbonyl)-2-fluorobenzenesulfonamide
TypeSmall organic molecule
Emp. Form.C44H48ClF3N6O4S
Mol. Mass.849.403
SMILESCC(C)(C)NS(=O)(=O)c1cc(C(=O)N2CCC(CCN3CCC(CC3)N(C(=O)NCc3ccc(cc3)C#N)c3cccc(F)c3)(CC2)c2cccc(F)c2)c(Cl)cc1F