Reaction Details
TargetMitogen-activated protein kinase 9
LigandBDBM50332079
Substrate/Competitorn/a
Meas. Tech.ChEMBL_687740 (CHEMBL1291186)
IC50 15000±n/a nM
Citation Hom, RKBowers, SSealy, JMTruong, APProbst, GDNeitzel, MLNeitz, RJFang, LBrogley, LWu, JKonradi, AWSham, HLTóth, GPan, HYao, NArtis, DRQuinn, KSauer, JMPowell, KRen, ZBard, FYednock, TAGriswold-Prenner, I Design and synthesis of disubstituted thiophene and thiazole based inhibitors of JNK. Bioorg Med Chem Lett20:7303-7 (2010) 
 
Mitogen-activated protein kinase 9
Name:Mitogen-activated protein kinase 9
Type:Enzyme
Mol. Mass.:48131.49
Organism:Homo sapiens (Human)
Description:JNK-2 was purchased from Upstate Cell Signaling Solutions (formerly Upstate Biotechnology).
Residue:424
BDBM50332079
NameBDBM50332079
Synonyms:2-(4-methoxyphenyl)-N-(2-(5-(trifluoromethyl)-1H-1,2,4-triazol-3-yl)thiophen-3-yl)acetamide | CHEMBL1288038
TypeSmall organic molecule
Emp. Form.C16H13F3N4O2S
Mol. Mass.382.36
SMILESCOc1ccc(CC(=O)Nc2ccsc2-c2nnc([nH]2)C(F)(F)F)cc1