Reaction Details
TargetMitogen-activated protein kinase 9
LigandBDBM50333980
Substrate/Competitorn/a
Meas. Tech.ChEMBL_701206 (CHEMBL1648826)
IC50 97±n/a nM
Citation Probst, GDBowers, SSealy, JMTruong, APHom, RKGalemmo, RAKonradi, AWSham, HLQuincy, DAPan, HYao, NLin, MTóth, GArtis, DRZmolek, WWong, KQin, ALorentzen, CNakamura, DFQuinn, KPSauer, JMPowell, KRuslim, LWright, SChereau, DRen, ZAnderson, JPBard, FYednock, TAGriswold-Prenner, I Highly selective c-Jun N-terminal kinase (JNK) 2 and 3 inhibitors with in vitro CNS-like pharmacokinetic properties prevent neurodegeneration. Bioorg Med Chem Lett21:315-9 (2010) 
 
Mitogen-activated protein kinase 9
Name:Mitogen-activated protein kinase 9
Type:Enzyme
Mol. Mass.:48131.49
Organism:Homo sapiens (Human)
Description:JNK-2 was purchased from Upstate Cell Signaling Solutions (formerly Upstate Biotechnology).
Residue:424
BDBM50333980
NameBDBM50333980
Synonyms:3-(2-(cyclohexylamino)pyridin-4-yl)-4-(naphthalen-2-yl)-1-(pyridin-4-ylmethyl)-1H-1,2,4-triazol-5(4H)-one | CHEMBL1644642
TypeSmall organic molecule
Emp. Form.C29H28N6O
Mol. Mass.476.5722
SMILESO=c1n(Cc2ccncc2)nc(-c2ccnc(NC3CCCCC3)c2)n1-c1ccc2ccccc2c1