Reaction Details
TargetMitogen-activated protein kinase 8
LigandBDBM50333983
Substrate/Competitorn/a
Meas. Tech.ChEMBL_701207 (CHEMBL1648827)
IC50 110±n/a nM
Citation Probst, GDBowers, SSealy, JMTruong, APHom, RKGalemmo, RAKonradi, AWSham, HLQuincy, DAPan, HYao, NLin, MTóth, GArtis, DRZmolek, WWong, KQin, ALorentzen, CNakamura, DFQuinn, KPSauer, JMPowell, KRuslim, LWright, SChereau, DRen, ZAnderson, JPBard, FYednock, TAGriswold-Prenner, I Highly selective c-Jun N-terminal kinase (JNK) 2 and 3 inhibitors with in vitro CNS-like pharmacokinetic properties prevent neurodegeneration. Bioorg Med Chem Lett21:315-9 (2010) 
 
Mitogen-activated protein kinase 8
Name:Mitogen-activated protein kinase 8
Type:Enzyme
Mol. Mass.:48297.57
Organism:Homo sapiens (Human)
Description:JNK-1 was purchased from Upstate Cell Signaling Solutions (formerly Upstate Biotechnology).
Residue:427
BDBM50333983
NameBDBM50333983
Synonyms:4-(8-chloronaphthalen-2-yl)-3-(2-(tetrahydro-2H-pyran-4-ylamino)pyridin-4-yl)-1H-1,2,4-triazol-5(4H)-one | CHEMBL1644637
TypeSmall organic molecule
Emp. Form.C22H20ClN5O2
Mol. Mass.421.88
SMILESClc1cccc2ccc(cc12)-n1c(n[nH]c1=O)-c1ccnc(NC2CCOCC2)c1