Reaction Details
TargetMitogen-activated protein kinase 14
LigandBDBM16016
Substrate/Competitorn/a
Meas. Tech.ChEMBL_701209 (CHEMBL1648829)
IC50 4±n/a nM
Citation Probst, GDBowers, SSealy, JMTruong, APHom, RKGalemmo, RAKonradi, AWSham, HLQuincy, DAPan, HYao, NLin, MTóth, GArtis, DRZmolek, WWong, KQin, ALorentzen, CNakamura, DFQuinn, KPSauer, JMPowell, KRuslim, LWright, SChereau, DRen, ZAnderson, JPBard, FYednock, TAGriswold-Prenner, I Highly selective c-Jun N-terminal kinase (JNK) 2 and 3 inhibitors with in vitro CNS-like pharmacokinetic properties prevent neurodegeneration. Bioorg Med Chem Lett21:315-9 (2010) 
 
Mitogen-activated protein kinase 14
Name:Mitogen-activated protein kinase 14
Type:Serine/threonine-protein kinase
Mol. Mass.:41286.76
Organism:Homo sapiens (Human)
Description:Q16539
Residue:360
BDBM16016
NameBDBM16016
Synonyms:CHEMBL437747 N-cyclohexyl-4-[4-(3,4-dichlorophenyl)-2-piperidin-4-yl-1-propyl-1H-imidazol-5-yl]pyrimidin-2-amine | imidazole-pyrimidine compound 2
TypeSmall organic molecule
Emp. Form.C27H34Cl2N6
Mol. Mass.513.505
SMILESCCCn1c(nc(c1-c1ccnc(NC2CCCCC2)n1)-c1ccc(Cl)c(Cl)c1)C1CCNCC1