Reaction Details
TargetMitogen-activated protein kinase 1
LigandBDBM50333997
Substrate/Competitorn/a
Meas. Tech.ChEMBL_701208 (CHEMBL1648828)
IC50>5000±n/a nM
Citation Probst, GDBowers, SSealy, JMTruong, APHom, RKGalemmo, RAKonradi, AWSham, HLQuincy, DAPan, HYao, NLin, MTóth, GArtis, DRZmolek, WWong, KQin, ALorentzen, CNakamura, DFQuinn, KPSauer, JMPowell, KRuslim, LWright, SChereau, DRen, ZAnderson, JPBard, FYednock, TAGriswold-Prenner, I Highly selective c-Jun N-terminal kinase (JNK) 2 and 3 inhibitors with in vitro CNS-like pharmacokinetic properties prevent neurodegeneration. Bioorg Med Chem Lett21:315-9 (2010) 
 
Mitogen-activated protein kinase 1
Name:Mitogen-activated protein kinase 1
Type:Ser/Thr Protein Kinase
Mol. Mass.:41392.76
Organism:Homo sapiens (Human)
Description:P28482
Residue:360
BDBM50333997
NameBDBM50333997
Synonyms:CHEMBL1644646 | methyl 4-(4-(naphthalen-2-yl)-5-oxo-3-(2-(tetrahydro-2H-pyran-4-ylamino)pyridin-4-yl)-4,5-dihydro-1H-1,2,4-triazol-1-yl)piperidine-1-carboxylate
TypeSmall organic molecule
Emp. Form.C29H32N6O4
Mol. Mass.528.6022
SMILESCOC(=O)N1CCC(CC1)n1nc(-c2ccnc(NC3CCOCC3)c2)n(-c2ccc3ccccc3c2)c1=O