Reaction Details
TargetMitogen-activated protein kinase 1
LigandBDBM50333999
Substrate/Competitorn/a
Meas. Tech.ChEMBL_701208 (CHEMBL1648828)
IC50>50000±n/a nM
Citation Probst, GDBowers, SSealy, JMTruong, APHom, RKGalemmo, RAKonradi, AWSham, HLQuincy, DAPan, HYao, NLin, MTóth, GArtis, DRZmolek, WWong, KQin, ALorentzen, CNakamura, DFQuinn, KPSauer, JMPowell, KRuslim, LWright, SChereau, DRen, ZAnderson, JPBard, FYednock, TAGriswold-Prenner, I Highly selective c-Jun N-terminal kinase (JNK) 2 and 3 inhibitors with in vitro CNS-like pharmacokinetic properties prevent neurodegeneration. Bioorg Med Chem Lett21:315-9 (2010) 
 
Mitogen-activated protein kinase 1
Name:Mitogen-activated protein kinase 1
Type:Ser/Thr Protein Kinase
Mol. Mass.:41392.76
Organism:Homo sapiens (Human)
Description:P28482
Residue:360
BDBM50333999
NameBDBM50333999
Synonyms:CHEMBL1644629 | N-(4-(4-(naphthalen-2-yl)-5-oxo-4,5-dihydro-1H-1,2,4-triazol-3-yl)pyridin-2-yl)acetamide
TypeSmall organic molecule
Emp. Form.C19H15N5O2
Mol. Mass.345.3547
SMILESCC(=O)Nc1cc(ccn1)-c1n[nH]c(=O)n1-c1ccc2ccccc2c1