Reaction Details
TargetMitogen-activated protein kinase 14
LigandBDBM50333984
Substrate/Competitorn/a
Meas. Tech.ChEMBL_701209 (CHEMBL1648829)
IC50>50000±n/a nM
Citation Probst, GDBowers, SSealy, JMTruong, APHom, RKGalemmo, RAKonradi, AWSham, HLQuincy, DAPan, HYao, NLin, MTóth, GArtis, DRZmolek, WWong, KQin, ALorentzen, CNakamura, DFQuinn, KPSauer, JMPowell, KRuslim, LWright, SChereau, DRen, ZAnderson, JPBard, FYednock, TAGriswold-Prenner, I Highly selective c-Jun N-terminal kinase (JNK) 2 and 3 inhibitors with in vitro CNS-like pharmacokinetic properties prevent neurodegeneration. Bioorg Med Chem Lett21:315-9 (2010) 
 
Mitogen-activated protein kinase 14
Name:Mitogen-activated protein kinase 14
Type:Serine/threonine-protein kinase
Mol. Mass.:41286.76
Organism:Homo sapiens (Human)
Description:Q16539
Residue:360
BDBM50333984
NameBDBM50333984
Synonyms:CHEMBL1644630 | N-(4-(4-(naphthalen-2-yl)-5-oxo-4,5-dihydro-1H-1,2,4-triazol-3-yl)pyridin-2-yl)cyclopropanecarboxamide
TypeSmall organic molecule
Emp. Form.C21H17N5O2
Mol. Mass.371.392
SMILESO=C(Nc1cc(ccn1)-c1n[nH]c(=O)n1-c1ccc2ccccc2c1)C1CC1