Reaction Details
TargetTyrosine-protein kinase JAK2
LigandBDBM50337336
Substrate/Competitorn/a
Meas. Tech.ChEMBL_726514 (CHEMBL1685409)
IC50 1.1±n/a nM
Citation Harikrishnan, LSKamau, MGWan, HInghrim, JAZimmermann, KSang, XMastalerz, HAJohnson, WLZhang, GLombardo, LJPoss, MATrainor, GLTokarski, JSLorenzi, MVYou, DGottardis, MMBaldwin, KFLippy, JNirschl, DSQiu, RMiller, AVKhan, JSack, JSPurandare, AV Pyrrolo[1,2-f]triazines as JAK2 inhibitors: achieving potency and selectivity for JAK2 over JAK3. Bioorg Med Chem Lett21:1425-8 (2011) 
 
Tyrosine-protein kinase JAK2
Name:Tyrosine-protein kinase JAK2
Type:Protein
Mol. Mass.:130684.68
Organism:Homo sapiens (Human)
Description:O60674
Residue:1132
BDBM50337336
NameBDBM50337336
Synonyms:1-(4-(4-(5-methyl-1H-pyrazol-3-ylamino)pyrrolo[1,2-f][1,2,4]triazin-2-yl)piperazin-1-yl)-2-p-tolylethanone | CHEMBL1682382
TypeSmall organic molecule
Emp. Form.C23H26N8O
Mol. Mass.430.5055
SMILESCc1cc(Nc2nc(nn3cccc23)N2CCN(CC2)C(=O)Cc2ccc(C)cc2)[nH]n1