Reaction Details
TargetTyrosine-protein kinase JAK2
LigandBDBM50337338
Substrate/Competitorn/a
Meas. Tech.ChEMBL_726514 (CHEMBL1685409)
IC50 1.8±n/a nM
Citation Harikrishnan, LSKamau, MGWan, HInghrim, JAZimmermann, KSang, XMastalerz, HAJohnson, WLZhang, GLombardo, LJPoss, MATrainor, GLTokarski, JSLorenzi, MVYou, DGottardis, MMBaldwin, KFLippy, JNirschl, DSQiu, RMiller, AVKhan, JSack, JSPurandare, AV Pyrrolo[1,2-f]triazines as JAK2 inhibitors: achieving potency and selectivity for JAK2 over JAK3. Bioorg Med Chem Lett21:1425-8 (2011) 
 
Tyrosine-protein kinase JAK2
Name:Tyrosine-protein kinase JAK2
Type:Protein
Mol. Mass.:130684.68
Organism:Homo sapiens (Human)
Description:O60674
Residue:1132
BDBM50337338
NameBDBM50337338
Synonyms:2-(2,6-difluoro-4-methoxyphenyl)-1-(4-(4-(5-methyl-1H-pyrazol-3-ylamino)pyrrolo[1,2-f][1,2,4]triazin-2-yl)piperazin-1-yl)ethanone CHEMBL1615027
TypeSmall organic molecule
Emp. Form.C23H24F2N8O2
Mol. Mass.482.4859
SMILESCOc1cc(F)c(CC(=O)N2CCN(CC2)c2nc(Nc3cc(C)n[nH]3)c3cccn3n2)c(F)c1