Reaction Details
TargetMitogen-activated protein kinase 9
LigandBDBM50338288
Substrate/Competitorn/a
Meas. Tech.ChEMBL_727961 (CHEMBL1686759)
IC50 125±n/a nM
Citation Bowers, STruong, APNeitz, RJNeitzel, MProbst, GDHom, RKPeterson, BGalemmo, RAKonradi, AWSham, HLTóth, GPan, HYao, NArtis, DRBrigham, EFQuinn, KPSauer, JMPowell, KRuslim, LRen, ZBard, FYednock, TAGriswold-Prenner, I Design and synthesis of a novel, orally active, brain penetrant, tri-substituted thiophene based JNK inhibitor. Bioorg Med Chem Lett21:1838-43 (2011) 
 
Mitogen-activated protein kinase 9
Name:Mitogen-activated protein kinase 9
Type:Enzyme
Mol. Mass.:48131.49
Organism:Homo sapiens (Human)
Description:JNK-2 was purchased from Upstate Cell Signaling Solutions (formerly Upstate Biotechnology).
Residue:424
BDBM50338288
NameBDBM50338288
Synonyms:CHEMBL1682011 | N-(4-methyl-3-(1H-1,2,4-triazol-5-yl)thiophen-2-yl)-2-(quinolin-5-yl)acetamide
TypeSmall organic molecule
Emp. Form.C18H15N5OS
Mol. Mass.349.41
SMILESCc1csc(NC(=O)Cc2cccc3ncccc23)c1-c1nnc[nH]1