Reaction Details
TargetMitogen-activated protein kinase 8
LigandBDBM50338263
Substrate/Competitorn/a
Meas. Tech.ChEMBL_727962 (CHEMBL1686760)
IC50 14±n/a nM
Citation Bowers, STruong, APNeitz, RJNeitzel, MProbst, GDHom, RKPeterson, BGalemmo, RAKonradi, AWSham, HLTóth, GPan, HYao, NArtis, DRBrigham, EFQuinn, KPSauer, JMPowell, KRuslim, LRen, ZBard, FYednock, TAGriswold-Prenner, I Design and synthesis of a novel, orally active, brain penetrant, tri-substituted thiophene based JNK inhibitor. Bioorg Med Chem Lett21:1838-43 (2011) 
 
Mitogen-activated protein kinase 8
Name:Mitogen-activated protein kinase 8
Type:Enzyme
Mol. Mass.:48297.57
Organism:Homo sapiens (Human)
Description:JNK-1 was purchased from Upstate Cell Signaling Solutions (formerly Upstate Biotechnology).
Residue:427
BDBM50338263
NameBDBM50338263
Synonyms:CHEMBL1682017 | N-(4-chloro-3-(1H-1,2,4-triazol-5-yl)thiophen-2-yl)-2-(isoquinolin-5-yl)acetamide
TypeSmall organic molecule
Emp. Form.C17H12ClN5OS
Mol. Mass.369.828
SMILESClc1csc(NC(=O)Cc2cccc3cnccc23)c1-c1nnc[nH]1