Reaction Details
TargetMitogen-activated protein kinase 1
LigandBDBM50338284
Substrate/Competitorn/a
Meas. Tech.ChEMBL_727964 (CHEMBL1686762)
IC50>5000±n/a nM
Citation Bowers, STruong, APNeitz, RJNeitzel, MProbst, GDHom, RKPeterson, BGalemmo, RAKonradi, AWSham, HLTóth, GPan, HYao, NArtis, DRBrigham, EFQuinn, KPSauer, JMPowell, KRuslim, LRen, ZBard, FYednock, TAGriswold-Prenner, I Design and synthesis of a novel, orally active, brain penetrant, tri-substituted thiophene based JNK inhibitor. Bioorg Med Chem Lett21:1838-43 (2011) 
 
Mitogen-activated protein kinase 1
Name:Mitogen-activated protein kinase 1
Type:Ser/Thr Protein Kinase
Mol. Mass.:41392.76
Organism:Homo sapiens (Human)
Description:P28482
Residue:360
BDBM50338284
NameBDBM50338284
Synonyms:CHEMBL1682007 US9796706, Compound 38
TypeSmall organic molecule
Emp. Form.C21H19N5OS
Mol. Mass.389.473
SMILESCc1nnc([nH]1)-c1c(C)csc1NC(=O)Cc1ccc(cc1)-c1ccncc1