Reaction Details
TargetMitogen-activated protein kinase 1
LigandBDBM50338285
Substrate/Competitorn/a
Meas. Tech.ChEMBL_727964 (CHEMBL1686762)
IC50>5000±n/a nM
Citation Bowers, STruong, APNeitz, RJNeitzel, MProbst, GDHom, RKPeterson, BGalemmo, RAKonradi, AWSham, HLTóth, GPan, HYao, NArtis, DRBrigham, EFQuinn, KPSauer, JMPowell, KRuslim, LRen, ZBard, FYednock, TAGriswold-Prenner, I Design and synthesis of a novel, orally active, brain penetrant, tri-substituted thiophene based JNK inhibitor. Bioorg Med Chem Lett21:1838-43 (2011) 
 
Mitogen-activated protein kinase 1
Name:Mitogen-activated protein kinase 1
Type:Ser/Thr Protein Kinase
Mol. Mass.:41392.76
Organism:Homo sapiens (Human)
Description:P28482
Residue:360
BDBM50338285
NameBDBM50338285
Synonyms:CHEMBL1682008 | N-(4-methyl-3-(3-methyl-1H-1,2,4-triazol-5-yl)thiophen-2-yl)-2-(4-(3-(piperidin-1-yl)propoxy)phenyl)acetamide
TypeSmall organic molecule
Emp. Form.C24H31N5O2S
Mol. Mass.453.6
SMILESCc1csc(NC(=O)Cc2ccc(OCCCN3CCCCC3)cc2)c1-c1nnc(C)[nH]1