Reaction Details
TargetMitogen-activated protein kinase 1
LigandBDBM50338291
Substrate/Competitorn/a
Meas. Tech.ChEMBL_727964 (CHEMBL1686762)
IC50>50000±n/a nM
Citation Bowers, STruong, APNeitz, RJNeitzel, MProbst, GDHom, RKPeterson, BGalemmo, RAKonradi, AWSham, HLTóth, GPan, HYao, NArtis, DRBrigham, EFQuinn, KPSauer, JMPowell, KRuslim, LRen, ZBard, FYednock, TAGriswold-Prenner, I Design and synthesis of a novel, orally active, brain penetrant, tri-substituted thiophene based JNK inhibitor. Bioorg Med Chem Lett21:1838-43 (2011) 
 
Mitogen-activated protein kinase 1
Name:Mitogen-activated protein kinase 1
Type:Ser/Thr Protein Kinase
Mol. Mass.:41392.76
Organism:Homo sapiens (Human)
Description:P28482
Residue:360
BDBM50338291
NameBDBM50338291
Synonyms:CHEMBL1682013 | N-(4-bromo-3-(1H-1,2,4-triazol-5-yl)thiophen-2-yl)-2-(2-oxo-3,4-dihydroquinolin-1(2H)-yl)acetamide
TypeSmall organic molecule
Emp. Form.C17H14BrN5O2S
Mol. Mass.432.294
SMILESBrc1csc(NC(=O)CN2C(=O)CCc3ccccc23)c1-c1nnc[nH]1