Reaction Details
TargetMitogen-activated protein kinase 10
LigandBDBM50338275
Substrate/Competitorn/a
Meas. Tech.ChEMBL_727960 (CHEMBL1686758)
IC50 504±n/a nM
Citation Bowers, STruong, APNeitz, RJNeitzel, MProbst, GDHom, RKPeterson, BGalemmo, RAKonradi, AWSham, HLTóth, GPan, HYao, NArtis, DRBrigham, EFQuinn, KPSauer, JMPowell, KRuslim, LRen, ZBard, FYednock, TAGriswold-Prenner, I Design and synthesis of a novel, orally active, brain penetrant, tri-substituted thiophene based JNK inhibitor. Bioorg Med Chem Lett21:1838-43 (2011) 
 
Mitogen-activated protein kinase 10
Name:Mitogen-activated protein kinase 10
Type:Enzyme
Mol. Mass.:52586.89
Organism:Homo sapiens (Human)
Description:n/a
Residue:464
BDBM50338275
NameBDBM50338275
Synonyms:CHEMBL1681999 | methyl 2-(2-(4-(3-(1H-imidazol-1-yl)propoxy)phenyl)acetamido)-4-methylthiophene-3-carboxylate
TypeSmall organic molecule
Emp. Form.C21H23N3O4S
Mol. Mass.413.49
SMILESCOC(=O)c1c(C)csc1NC(=O)Cc1ccc(OCCCn2ccnc2)cc1