Reaction Details
TargetMitogen-activated protein kinase 10
LigandBDBM50338287
Substrate/Competitorn/a
Meas. Tech.ChEMBL_727960 (CHEMBL1686758)
IC50 80±n/a nM
Citation Bowers, STruong, APNeitz, RJNeitzel, MProbst, GDHom, RKPeterson, BGalemmo, RAKonradi, AWSham, HLTóth, GPan, HYao, NArtis, DRBrigham, EFQuinn, KPSauer, JMPowell, KRuslim, LRen, ZBard, FYednock, TAGriswold-Prenner, I Design and synthesis of a novel, orally active, brain penetrant, tri-substituted thiophene based JNK inhibitor. Bioorg Med Chem Lett21:1838-43 (2011) 
 
Mitogen-activated protein kinase 10
Name:Mitogen-activated protein kinase 10
Type:Enzyme
Mol. Mass.:52586.89
Organism:Homo sapiens (Human)
Description:n/a
Residue:464
BDBM50338287
NameBDBM50338287
Synonyms:CHEMBL1682010 | N-(4-methyl-3-(3-methyl-1H-1,2,4-triazol-5-yl)thiophen-2-yl)-2-(quinolin-5-yl)acetamide
TypeSmall organic molecule
Emp. Form.C19H17N5OS
Mol. Mass.363.436
SMILESCc1nnc([nH]1)-c1c(C)csc1NC(=O)Cc1cccc2ncccc12