Reaction Details
TargetEphrin type-A receptor 2
LigandBDBM50339609
Substrate/Competitorn/a
Meas. Tech.ChEMBL_734984 (CHEMBL1693591)
IC50 18±n/a nM
Citation Gould, AEAdams, RAdhikari, SAertgeerts, KAfroze, RBlackburn, CCalderwood, EFChau, RChouitar, JDuffey, MOEngland, DBFarrer, CForsyth, NGarcia, KGaulin, JGreenspan, PDGuo, RHarrison, SJHuang, SCIartchouk, NJanowick, DKim, MSKulkarni, BLangston, SPLiu, JXMa, LTMenon, SMizutani, HPaske, ERenou, CCRezaei, MRowland, RSSintchak, MDSmith, MDStroud, SGTregay, MTian, YVeiby, OPVos, TJVyskocil, SWilliams, JXu, TYang, JJYano, JZeng, HZhang, DMZhang, QGalvin, KM Design and optimization of potent and orally bioavailable tetrahydronaphthalene Raf inhibitors. J Med Chem54:1836-46 (2011) 
 
Ephrin type-A receptor 2
Name:Ephrin type-A receptor 2
Type:PROTEIN
Mol. Mass.:108260.70
Organism:Homo sapiens (Human)
Description:ChEMBL_1505248
Residue:976
BDBM50339609
NameBDBM50339609
Synonyms:3-[(Dimethylamino)methyl]-N-{(2R)-7-[(7-oxo-5,6,7,8-tetrahydro-1,8-naphthyridin-4-yl)oxy]-1,2,3,4-tetrahydronaphthalen-2-yl}-5-(trifluoromethyl)benzamide | CHEMBL1688860
TypeSmall organic molecule
Emp. Form.C29H29F3N4O3
Mol. Mass.538.5608
SMILESCN(C)Cc1cc(cc(c1)C(F)(F)F)C(=O)N[C@@H]1CCc2ccc(Oc3ccnc4NC(=O)CCc34)cc2C1