Reaction Details
TargetEphrin type-B receptor 4
LigandBDBM50340572
Substrate/Competitorn/a
Meas. Tech.ChEMBL_741350 (CHEMBL1764819)
IC50 7±n/a nM
Citation Barlaam, BDucray, RLambert-van der Brempt, CPlé, PBardelle, CBrooks, NColeman, TCross, DKettle, JGRead, J Inhibitors of the tyrosine kinase EphB4. Part 4: Discovery and optimization of a benzylic alcohol series. Bioorg Med Chem Lett21:2207-11 (2011) 
 
Ephrin type-B receptor 4
Name:Ephrin type-B receptor 4
Type:Enzyme
Mol. Mass.:108273.51
Organism:Homo sapiens (Human)
Description:P54760
Residue:987
BDBM50340572
NameBDBM50340572
Synonyms:(3-((2-(3,5-dimorpholinophenylamino)pyrimidin-4-yl)(methyl)amino)-5-methoxyphenyl)methanol | CHEMBL1762529
TypeSmall organic molecule
Emp. Form.C27H34N6O4
Mol. Mass.506.5967
SMILESCOc1cc(CO)cc(c1)N(C)c1ccnc(Nc2cc(cc(c2)N2CCOCC2)N2CCOCC2)n1