Reaction Details
TargetEphrin type-B receptor 4
LigandBDBM50340577
Substrate/Competitorn/a
Meas. Tech.ChEMBL_741347 (CHEMBL1764816)
IC50 6±n/a nM
Citation Barlaam, BDucray, RLambert-van der Brempt, CPlé, PBardelle, CBrooks, NColeman, TCross, DKettle, JGRead, J Inhibitors of the tyrosine kinase EphB4. Part 4: Discovery and optimization of a benzylic alcohol series. Bioorg Med Chem Lett21:2207-11 (2011) 
 
Ephrin type-B receptor 4
Name:Ephrin type-B receptor 4
Type:Enzyme
Mol. Mass.:108273.51
Organism:Homo sapiens (Human)
Description:P54760
Residue:987
BDBM50340577
NameBDBM50340577
Synonyms:CHEMBL1762524 | N4-(3-chlorophenyl)-N2-(3,5-dimorpholinophenyl)-N4-methylpyrimidine-2,4-diamine
TypeSmall organic molecule
Emp. Form.C25H29ClN6O2
Mol. Mass.480.99
SMILESCN(c1cccc(Cl)c1)c1ccnc(Nc2cc(cc(c2)N2CCOCC2)N2CCOCC2)n1