Reaction Details
TargetCytochrome P450 2C9
LigandBDBM50352205
Substrate/Competitorn/a
Meas. Tech.ChEMBL_767448 (CHEMBL1825560)
IC50>10000±n/a nM
Citation Zhang, LFan, JChong, JHCesena, ATam, BYGilson, CBoykin, CWang, DAivazian, DMarcotte, DXiao, GLe Brazidec, JYPiao, JLundgren, KHong, KVu, KNguyen, KGan, LSSilvian, LLing, LTeng, MReff, MTakeda, NTimple, NWang, QMorena, RKhan, SZhao, SLi, TLee, WCTaveras, AGChao, J Design, synthesis, and biological evaluation of pyrazolopyrimidine-sulfonamides as potent multiple-mitotic kinase (MMK) inhibitors (part I). Bioorg Med Chem Lett21:5633-7 (2011) 
 
Cytochrome P450 2C9
Name:Cytochrome P450 2C9
Type:Enzyme
Mol. Mass.:55636.33
Organism:Homo sapiens (Human)
Description:P11712
Residue:490
BDBM50352205
NameBDBM50352205
Synonyms:CHEMBL1825096
TypeSmall organic molecule
Emp. Form.C18H23N7O2S
Mol. Mass.401.486
SMILESCS(=O)(=O)Nc1ccc(Nc2ncc3cnn(C4CCCCCC4)c3n2)cn1