Reaction Details
TargetAurora kinase A
LigandBDBM50352211
Substrate/Competitorn/a
Meas. Tech.ChEMBL_767346 (CHEMBL1825458)
IC50 9±n/a nM
Citation Zhang, LFan, JChong, JHCesena, ATam, BYGilson, CBoykin, CWang, DAivazian, DMarcotte, DXiao, GLe Brazidec, JYPiao, JLundgren, KHong, KVu, KNguyen, KGan, LSSilvian, LLing, LTeng, MReff, MTakeda, NTimple, NWang, QMorena, RKhan, SZhao, SLi, TLee, WCTaveras, AGChao, J Design, synthesis, and biological evaluation of pyrazolopyrimidine-sulfonamides as potent multiple-mitotic kinase (MMK) inhibitors (part I). Bioorg Med Chem Lett21:5633-7 (2011) 
 
Aurora kinase A
Name:Aurora kinase A
Type:Serine/threonine-protein kinase
Mol. Mass.:45830.98
Organism:Homo sapiens (Human)
Description:O14965
Residue:403
BDBM50352211
NameBDBM50352211
Synonyms:CHEMBL1825095
TypeSmall organic molecule
Emp. Form.C27H39N7O2S
Mol. Mass.525.709
SMILESCS(=O)(=O)N(CCCN1CCCCC1)c1ccc(Nc2ncc3cnn(C4CCCCCC4)c3n2)cc1