Reaction Details
TargetMitogen-activated protein kinase 10
LigandBDBM50352601
Substrate/Competitorn/a
Meas. Tech.ChEMBL_767484 (CHEMBL1825596)
IC50 24±n/a nM
Citation Bowers, STruong, APJeffrey Neitz, RHom, RKSealy, JMProbst, GDQuincy, DPeterson, BChan, WGalemmo, RAKonradi, AWSham, HLTóth, GPan, HLin, MYao, NArtis, DRZhang, HChen, LDryer, MSamant, BZmolek, WWong, KLorentzen, CGoldbach, ETonn, GQuinn, KPSauer, JMWright, SPowell, KRuslim, LRen, ZBard, FYednock, TAGriswold-Prenner, I Design and synthesis of brain penetrant selective JNK inhibitors with improved pharmacokinetic properties for the prevention of neurodegeneration. Bioorg Med Chem Lett21:5521-7 (2011) 
 
Mitogen-activated protein kinase 10
Name:Mitogen-activated protein kinase 10
Type:Enzyme
Mol. Mass.:52586.89
Organism:Homo sapiens (Human)
Description:n/a
Residue:464
BDBM50352601
NameBDBM50352601
Synonyms:CHEMBL1822132
TypeSmall organic molecule
Emp. Form.C17H11BrFN5OS
Mol. Mass.432.27
SMILESFc1ccc(CC(=O)Nc2scc(Br)c2-c2nnc[nH]2)c2ccncc12