Reaction Details
TargetMitogen-activated protein kinase 10
LigandBDBM50352627
Substrate/Competitorn/a
Meas. Tech.ChEMBL_767484 (CHEMBL1825596)
IC50 9±n/a nM
Citation Bowers, STruong, APJeffrey Neitz, RHom, RKSealy, JMProbst, GDQuincy, DPeterson, BChan, WGalemmo, RAKonradi, AWSham, HLTóth, GPan, HLin, MYao, NArtis, DRZhang, HChen, LDryer, MSamant, BZmolek, WWong, KLorentzen, CGoldbach, ETonn, GQuinn, KPSauer, JMWright, SPowell, KRuslim, LRen, ZBard, FYednock, TAGriswold-Prenner, I Design and synthesis of brain penetrant selective JNK inhibitors with improved pharmacokinetic properties for the prevention of neurodegeneration. Bioorg Med Chem Lett21:5521-7 (2011) 
 
Mitogen-activated protein kinase 10
Name:Mitogen-activated protein kinase 10
Type:Enzyme
Mol. Mass.:52586.89
Organism:Homo sapiens (Human)
Description:n/a
Residue:464
BDBM50352627
NameBDBM50352627
Synonyms:CHEMBL1822308 | US9796706, Compound 134
TypeSmall organic molecule
Emp. Form.C20H11F3N4O2S2
Mol. Mass.460.452
SMILESFC(F)(F)c1ccc2n(CC(=O)Nc3scc(C#N)c3-c3nccs3)c(=O)ccc2c1