Reaction Details
TargetMitogen-activated protein kinase 9
LigandBDBM50352612
Substrate/Competitorn/a
Meas. Tech.ChEMBL_767487 (CHEMBL1825599)
IC50 74±n/a nM
Citation Bowers, STruong, APJeffrey Neitz, RHom, RKSealy, JMProbst, GDQuincy, DPeterson, BChan, WGalemmo, RAKonradi, AWSham, HLTóth, GPan, HLin, MYao, NArtis, DRZhang, HChen, LDryer, MSamant, BZmolek, WWong, KLorentzen, CGoldbach, ETonn, GQuinn, KPSauer, JMWright, SPowell, KRuslim, LRen, ZBard, FYednock, TAGriswold-Prenner, I Design and synthesis of brain penetrant selective JNK inhibitors with improved pharmacokinetic properties for the prevention of neurodegeneration. Bioorg Med Chem Lett21:5521-7 (2011) 
 
Mitogen-activated protein kinase 9
Name:Mitogen-activated protein kinase 9
Type:Enzyme
Mol. Mass.:48131.49
Organism:Homo sapiens (Human)
Description:JNK-2 was purchased from Upstate Cell Signaling Solutions (formerly Upstate Biotechnology).
Residue:424
BDBM50352612
NameBDBM50352612
Synonyms:CHEMBL1822143
TypeSmall organic molecule
Emp. Form.C14H10BrN7O2S
Mol. Mass.420.244
SMILESBrc1csc(NC(=O)Cn2c3ccnn3ccc2=O)c1-c1nnc[nH]1