Reaction Details
TargetMitogen-activated protein kinase 9
LigandBDBM50352617
Substrate/Competitorn/a
Meas. Tech.ChEMBL_767487 (CHEMBL1825599)
IC50 193±n/a nM
Citation Bowers, STruong, APJeffrey Neitz, RHom, RKSealy, JMProbst, GDQuincy, DPeterson, BChan, WGalemmo, RAKonradi, AWSham, HLTóth, GPan, HLin, MYao, NArtis, DRZhang, HChen, LDryer, MSamant, BZmolek, WWong, KLorentzen, CGoldbach, ETonn, GQuinn, KPSauer, JMWright, SPowell, KRuslim, LRen, ZBard, FYednock, TAGriswold-Prenner, I Design and synthesis of brain penetrant selective JNK inhibitors with improved pharmacokinetic properties for the prevention of neurodegeneration. Bioorg Med Chem Lett21:5521-7 (2011) 
 
Mitogen-activated protein kinase 9
Name:Mitogen-activated protein kinase 9
Type:Enzyme
Mol. Mass.:48131.49
Organism:Homo sapiens (Human)
Description:JNK-2 was purchased from Upstate Cell Signaling Solutions (formerly Upstate Biotechnology).
Residue:424
BDBM50352617
NameBDBM50352617
Synonyms:CHEMBL1822148
TypeSmall organic molecule
Emp. Form.C18H11BrF3N5O2S
Mol. Mass.498.276
SMILESFC(F)(F)c1cccc2n(CC(=O)Nc3scc(Br)c3-c3nnc[nH]3)c(=O)ccc12