Reaction Details
TargetPotassium voltage-gated channel subfamily H member 2
LigandBDBM50419203
Substrate/Competitorn/a
Meas. Tech.ChEMBL_770506 (CHEMBL1839209)
IC50 19952.62±n/a nM
Citation Demont, EHArpino, SBit, RACampbell, CADeeks, NDesai, SDowell, SJGaskin, PGray, JRHarrison, LAHaynes, AHeightman, TDHolmes, DSHumphreys, PGKumar, UMorse, MAOsborne, GJPanchal, TPhilpott, KLTaylor, SWatson, RWillis, RWitherington, J Discovery of a brain-penetrant S1P3-sparing direct agonist of the S1P¿? and S1P5 receptors efficacious at low oral dose. J Med Chem54:6724-33 (2011) 
 
Potassium voltage-gated channel subfamily H member 2
Name:Potassium voltage-gated channel subfamily H member 2
Type:Multi-pass membrane protein
Mol. Mass.:126672.65
Organism:Homo sapiens (Human)
Description:Q12809
Residue:1159
BDBM50419203
NameBDBM50419203
Synonyms:CHEMBL1836214
TypeSmall organic molecule
Emp. Form.C24H26N4O4
Mol. Mass.434.4876
SMILESCC(C)Oc1ccc(cc1C#N)-c1nc(no1)-c1ccc2CN(CCc2c1)C(CO)CO