Reaction Details
TargetSphingosine 1-phosphate receptor 3
LigandBDBM50419202
Substrate/Competitorn/a
Meas. Tech.ChEMBL_770834 (CHEMBL1837782)
EC50>31622.78±n/a nM
Citation Demont, EHArpino, SBit, RACampbell, CADeeks, NDesai, SDowell, SJGaskin, PGray, JRHarrison, LAHaynes, AHeightman, TDHolmes, DSHumphreys, PGKumar, UMorse, MAOsborne, GJPanchal, TPhilpott, KLTaylor, SWatson, RWillis, RWitherington, J Discovery of a brain-penetrant S1P3-sparing direct agonist of the S1P¿? and S1P5 receptors efficacious at low oral dose. J Med Chem54:6724-33 (2011) 
 
Sphingosine 1-phosphate receptor 3
Name:Sphingosine 1-phosphate receptor 3
Type:G Protein-Coupled Receptor (GPCR)
Mol. Mass.:42278.13
Organism:Homo sapiens (Human)
Description:Q99500
Residue:378
BDBM50419202
NameBDBM50419202
Synonyms:CHEMBL1836169
TypeSmall organic molecule
Emp. Form.C25H26N4O4
Mol. Mass.446.4983
SMILESCC(C)Oc1ccc(cc1C#N)-c1nc(no1)-c1ccc2CN(CCC(O)=O)CCc2c1C