Reaction Details
TargetMitogen-activated protein kinase kinase kinase 9
LigandBDBM50358204
Substrate/Competitorn/a
Meas. Tech.ChEMBL_790095 (CHEMBL1925485)
IC50 232±n/a nM
Citation Sutherlin, DPBao, LBerry, MCastanedo, GChuckowree, IDotson, JFolks, AFriedman, LGoldsmith, RGunzner, JHeffron, TLesnick, JLewis, CMathieu, SMurray, JNonomiya, JPang, JPegg, NPrior, WWRouge, LSalphati, LSampath, DTian, QTsui, VWan, NCWang, SWei, BWiesmann, CWu, PZhu, BYOlivero, A Discovery of a potent, selective, and orally available class I phosphatidylinositol 3-kinase (PI3K)/mammalian target of rapamycin (mTOR) kinase inhibitor (GDC-0980) for the treatment of cancer. J Med Chem54:7579-87 (2011) 
 
Mitogen-activated protein kinase kinase kinase 9
Name:Mitogen-activated protein kinase kinase kinase 9
Type:protein
Mol. Mass.:121881.51
Organism:Homo sapiens (Human)
Description:P80192
Residue:1104
BDBM50358204
NameBDBM50358204
Synonyms:CHEMBL1922094
TypeSmall organic molecule
Emp. Form.C23H30N8O3S
Mol. Mass.498.601
SMILESC[C@H](O)C(=O)N1CCN(Cc2sc3c(nc(nc3c2C)-c2cnc(N)nc2)N2CCOCC2)CC1