Reaction Details
TargetSerine/threonine-protein kinase mTOR
LigandBDBM50358205
Substrate/Competitorn/a
Meas. Tech.ChEMBL_790078 (CHEMBL1925468)
Ki 12±n/a nM
Citation Sutherlin, DPBao, LBerry, MCastanedo, GChuckowree, IDotson, JFolks, AFriedman, LGoldsmith, RGunzner, JHeffron, TLesnick, JLewis, CMathieu, SMurray, JNonomiya, JPang, JPegg, NPrior, WWRouge, LSalphati, LSampath, DTian, QTsui, VWan, NCWang, SWei, BWiesmann, CWu, PZhu, BYOlivero, A Discovery of a potent, selective, and orally available class I phosphatidylinositol 3-kinase (PI3K)/mammalian target of rapamycin (mTOR) kinase inhibitor (GDC-0980) for the treatment of cancer. J Med Chem54:7579-87 (2011) 
 
Serine/threonine-protein kinase mTOR
Name:Serine/threonine-protein kinase mTOR
Type:Rapamycin target protein
Mol. Mass.:288917.12
Organism:Homo sapiens (Human)
Description:P42345
Residue:2549
BDBM50358205
NameBDBM50358205
Synonyms:CHEMBL1922090
TypeSmall organic molecule
Emp. Form.C22H29N9O2S
Mol. Mass.483.59
SMILESCc1c(CN2CCN(CC2)C(=O)CN)sc2c(nc(nc12)-c1cnc(N)nc1)N1CCOCC1