Reaction Details
TargetCytochrome P450 3A4
LigandBDBM50041457
Substrate/Competitorn/a
Meas. Tech.ChEMBL_567193 (CHEMBL1029105)
IC50 28000±n/a nM
Citation O'Neill, PMShone, AEStanford, DNixon, GAsadollahy, EPark, BKMaggs, JLRoberts, PStocks, PABiagini, GBray, PGDavies, JBerry, NHall, CRimmer, KWinstanley, PAHindley, SBambal, RBDavis, CBBates, MGresham, SLBrigandi, RAGomez-de-Las-Heras, FMGargallo, DVParapini, SVivas, LLander, HTaramelli, DWard, SA Synthesis, antimalarial activity, and preclinical pharmacology of a novel series of 4'-fluoro and 4'-chloro analogues of amodiaquine. Identification of a suitable"back-up" compound for N-tert-butyl isoquine. J Med Chem52:1828-44 (2009) 
 
Cytochrome P450 3A4
Name:Cytochrome P450 3A4
Type:Enzyme
Mol. Mass.:57349.57
Organism:Homo sapiens (Human)
Description:n/a
Residue:503
BDBM50041457
NameBDBM50041457
Synonyms:4-[(7-chloroquinolin-4-yl)amino]-2-[(diethylamino)methyl]phenol CHEMBL682 | med.21724, Compound 188
TypeSmall organic molecule
Emp. Form.C20H22ClN3O
Mol. Mass.355.861
SMILESCCN(CC)Cc1cc(Nc2ccnc3cc(Cl)ccc23)ccc1O