Reaction Details
TargetPhosphatidylinositol 4,5-bisphosphate 3-kinase catalytic subunit delta isoform
LigandBDBM50394896
Substrate/Competitorn/a
Meas. Tech.ChEMBL_860672 (CHEMBL2167812)
IC50 4.3±n/a nM
Citation Safina, BSBaker, SBaumgardner, MBlaney, PMChan, BKChen, YHCartwright, MWCastanedo, GChabot, CCheguillaume, AJGoldsmith, PGoldstein, DMGoyal, BHancox, THanda, RKIyer, PSKaur, JKondru, RKenny, JRKrintel, SLLi, JLesnick, JLucas, MCLewis, CMukadam, SMurray, JNadin, AJNonomiya, JPadilla, FPalmer, WSPang, JPegg, NPrice, SReif, KSalphati, LSavy, PASeward, EMShuttleworth, SSohal, SSweeney, ZKTay, STivitmahaisoon, PWaszkowycz, BWei, BYue, QZhang, CSutherlin, DP Discovery of novel PI3-kinased specific inhibitors for the treatment of rheumatoid arthritis: taming CYP3A4 time-dependent inhibition. J Med Chem55:5887-900 (2012) 
 
Phosphatidylinositol 4,5-bisphosphate 3-kinase catalytic subunit delta isoform
Name:Phosphatidylinositol 4,5-bisphosphate 3-kinase catalytic subunit delta isoform
Type:Enzyme Subunit
Mol. Mass.:119489.41
Organism:Homo sapiens (Human)
Description:O00329
Residue:1044
BDBM50394896
NameBDBM50394896
Synonyms:CHEMBL2165499
TypeSmall organic molecule
Emp. Form.C27H34N8O2S
Mol. Mass.534.676
SMILESCc1nc2ccccc2n1-c1nc(N2CCOCC2)c2sc(CN3CCN(CC3)C(C)(C)C(N)=O)cc2n1