Reaction Details
TargetPhosphatidylinositol 4,5-bisphosphate 3-kinase catalytic subunit delta isoform
LigandBDBM50394904
Substrate/Competitorn/a
Meas. Tech.ChEMBL_860672 (CHEMBL2167812)
IC50 29±n/a nM
Citation Safina, BSBaker, SBaumgardner, MBlaney, PMChan, BKChen, YHCartwright, MWCastanedo, GChabot, CCheguillaume, AJGoldsmith, PGoldstein, DMGoyal, BHancox, THanda, RKIyer, PSKaur, JKondru, RKenny, JRKrintel, SLLi, JLesnick, JLucas, MCLewis, CMukadam, SMurray, JNadin, AJNonomiya, JPadilla, FPalmer, WSPang, JPegg, NPrice, SReif, KSalphati, LSavy, PASeward, EMShuttleworth, SSohal, SSweeney, ZKTay, STivitmahaisoon, PWaszkowycz, BWei, BYue, QZhang, CSutherlin, DP Discovery of novel PI3-kinased specific inhibitors for the treatment of rheumatoid arthritis: taming CYP3A4 time-dependent inhibition. J Med Chem55:5887-900 (2012) 
 
Phosphatidylinositol 4,5-bisphosphate 3-kinase catalytic subunit delta isoform
Name:Phosphatidylinositol 4,5-bisphosphate 3-kinase catalytic subunit delta isoform
Type:Enzyme Subunit
Mol. Mass.:119489.41
Organism:Homo sapiens (Human)
Description:O00329
Residue:1044
BDBM50394904
NameBDBM50394904
Synonyms:CHEMBL2165670
TypeSmall organic molecule
Emp. Form.C28H34N6OS
Mol. Mass.502.674
SMILESCN(C)C1CCN(Cc2cc3nc(nc(N4CCOCC4)c3s2)-c2c(C)ncc3ccccc23)CC1