Reaction Details
TargetPhosphatidylinositol 4,5-bisphosphate 3-kinase catalytic subunit delta isoform
LigandBDBM50394919
Substrate/Competitorn/a
Meas. Tech.ChEMBL_860672 (CHEMBL2167812)
IC50 3.1±n/a nM
Citation Safina, BSBaker, SBaumgardner, MBlaney, PMChan, BKChen, YHCartwright, MWCastanedo, GChabot, CCheguillaume, AJGoldsmith, PGoldstein, DMGoyal, BHancox, THanda, RKIyer, PSKaur, JKondru, RKenny, JRKrintel, SLLi, JLesnick, JLucas, MCLewis, CMukadam, SMurray, JNadin, AJNonomiya, JPadilla, FPalmer, WSPang, JPegg, NPrice, SReif, KSalphati, LSavy, PASeward, EMShuttleworth, SSohal, SSweeney, ZKTay, STivitmahaisoon, PWaszkowycz, BWei, BYue, QZhang, CSutherlin, DP Discovery of novel PI3-kinased specific inhibitors for the treatment of rheumatoid arthritis: taming CYP3A4 time-dependent inhibition. J Med Chem55:5887-900 (2012) 
 
Phosphatidylinositol 4,5-bisphosphate 3-kinase catalytic subunit delta isoform
Name:Phosphatidylinositol 4,5-bisphosphate 3-kinase catalytic subunit delta isoform
Type:Enzyme Subunit
Mol. Mass.:119489.41
Organism:Homo sapiens (Human)
Description:O00329
Residue:1044
BDBM50394919
NameBDBM50394919
Synonyms:CHEMBL2165503
TypeSmall organic molecule
Emp. Form.C26H32N8O2S
Mol. Mass.520.65
SMILESCC(C)(N1CCN(Cc2cc3nc(nc(N4CCOCC4)c3s2)-c2cccc3[nH]ncc23)CC1)C(N)=O