Reaction Details
TargetCytochrome P450 3A4
LigandBDBM50394910
Substrate/Competitorn/a
Meas. Tech.ChEMBL_860549 (CHEMBL2167123)
IC50 3200±n/a nM
Citation Safina, BSBaker, SBaumgardner, MBlaney, PMChan, BKChen, YHCartwright, MWCastanedo, GChabot, CCheguillaume, AJGoldsmith, PGoldstein, DMGoyal, BHancox, THanda, RKIyer, PSKaur, JKondru, RKenny, JRKrintel, SLLi, JLesnick, JLucas, MCLewis, CMukadam, SMurray, JNadin, AJNonomiya, JPadilla, FPalmer, WSPang, JPegg, NPrice, SReif, KSalphati, LSavy, PASeward, EMShuttleworth, SSohal, SSweeney, ZKTay, STivitmahaisoon, PWaszkowycz, BWei, BYue, QZhang, CSutherlin, DP Discovery of novel PI3-kinased specific inhibitors for the treatment of rheumatoid arthritis: taming CYP3A4 time-dependent inhibition. J Med Chem55:5887-900 (2012) 
 
Cytochrome P450 3A4
Name:Cytochrome P450 3A4
Type:Enzyme
Mol. Mass.:57349.57
Organism:Homo sapiens (Human)
Description:n/a
Residue:503
BDBM50394910
NameBDBM50394910
Synonyms:CHEMBL2165512
TypeSmall organic molecule
Emp. Form.C26H32N8O2S
Mol. Mass.520.65
SMILESCC(C)(N1CCN(Cc2cc3nc(nc(N4CCOCC4)c3s2)-c2cncc3[nH]ccc23)CC1)C(N)=O