Reaction Details
TargetGlucose-6-phosphate 1-dehydrogenase
LigandBDBM50396513
Substrate/Competitorn/a
Meas. Tech.ChEMBL_862643 (CHEMBL2174116)
IC50>80000±n/a nM
Citation Preuss, JMaloney, PPeddibhotla, SHedrick, MPHershberger, PGosalia, PMilewski, MLi, YLSugarman, EHood, BSuyama, ENguyen, KVasile, SSergienko, EMangravita-Novo, AVicchiarelli, MMcAnally, DSmith, LHRoth, GPDiwan, JChung, TDJortzik, ERahlfs, SBecker, KPinkerton, ABBode, L Discovery of a Plasmodium falciparum glucose-6-phosphate dehydrogenase 6-phosphogluconolactonase inhibitor (R,Z)-N-((1-ethylpyrrolidin-2-yl)methyl)-2-(2-fluorobenzylidene)-3-oxo-3,4-dihydro-2H-benzo[b][1,4]thiazine-6-carboxamide (ML276) that reduces parasite growth in vitro. J Med Chem55:7262-72 (2012) 
 
Glucose-6-phosphate 1-dehydrogenase
Name:Glucose-6-phosphate 1-dehydrogenase
Type:Enzyme
Mol. Mass.:59258.58
Organism:Homo sapiens (Human)
Description:P11413
Residue:515
BDBM50396513
NameBDBM50396513
Synonyms:CHEMBL2171111
TypeSmall organic molecule
Emp. Form.C21H20FN3O2S
Mol. Mass.397.466
SMILESFc1ccccc1\C=C1/Sc2ccc(cc2NC1=O)C(=O)NCC1CCCN1