Reaction Details
TargetP2Y purinoceptor 1
LigandBDBM50017088
Substrate/Competitorn/a
Meas. Tech.ChEMBL_1365183 (CHEMBL3292933)
IC50 0.130000±n/a nM
Citation Jeon, YTYang, WQiao, JXLi, LRuel, RThibeault, CHiebert, SWang, TCWang, YLiu, YClark, CGWong, HSZhu, JWu, DRSun, DChen, BCMathur, AChacko, SAMalley, MChen, XQShen, HHuang, CSSchumacher, WABostwick, JSStewart, ABPrice, LAHua, JLi, DLevesque, PCSeiffert, DARehfuss, RWexler, RRLam, PY Identification of 1-{2-[4-chloro-1'-(2,2-dimethylpropyl)-7-hydroxy-1,2-dihydrospiro[indole-3,4'-piperidine]-1-yl]phenyl}-3-{5-chloro-[1,3]thiazolo[5,4-b]pyridin-2-yl}urea, a potent, efficacious and orally bioavailable P2Y(1) antagonist as an antiplatelet agent. Bioorg Med Chem Lett24:1294-8 (2014) 
 
P2Y purinoceptor 1
Name:P2Y purinoceptor 1
Type:Enzyme
Mol. Mass.:42090.25
Organism:Homo sapiens (Human)
Description:P47900
Residue:373
BDBM50017088
NameBDBM50017088
Synonyms:CHEMBL3287042 | US9428504, 89
TypeSmall organic molecule
Emp. Form.C33H40F3N5O5S
Mol. Mass.675.761
SMILESCN(C)S(=O)(=O)c1ccc(O)c2N(CC3(CCN(CC(C)(C)C)CC3)c12)c1ccccc1NC(=O)Nc1ccc(OC(F)(F)F)cc1