Reaction Details
TargetP2Y purinoceptor 1
LigandBDBM50017090
Substrate/Competitorn/a
Meas. Tech.ChEMBL_1365183 (CHEMBL3292933)
IC50 0.040000±n/a nM
Citation Jeon, YTYang, WQiao, JXLi, LRuel, RThibeault, CHiebert, SWang, TCWang, YLiu, YClark, CGWong, HSZhu, JWu, DRSun, DChen, BCMathur, AChacko, SAMalley, MChen, XQShen, HHuang, CSSchumacher, WABostwick, JSStewart, ABPrice, LAHua, JLi, DLevesque, PCSeiffert, DARehfuss, RWexler, RRLam, PY Identification of 1-{2-[4-chloro-1'-(2,2-dimethylpropyl)-7-hydroxy-1,2-dihydrospiro[indole-3,4'-piperidine]-1-yl]phenyl}-3-{5-chloro-[1,3]thiazolo[5,4-b]pyridin-2-yl}urea, a potent, efficacious and orally bioavailable P2Y(1) antagonist as an antiplatelet agent. Bioorg Med Chem Lett24:1294-8 (2014) 
 
P2Y purinoceptor 1
Name:P2Y purinoceptor 1
Type:Enzyme
Mol. Mass.:42090.25
Organism:Homo sapiens (Human)
Description:P47900
Residue:373
BDBM50017090
NameBDBM50017090
Synonyms:CHEMBL3287044 | US9428504, 59
TypeSmall organic molecule
Emp. Form.C31H34ClF3N4O3
Mol. Mass.603.075
SMILESCC(C)(C)CN1CCC2(CN(c3c2c(Cl)ccc3O)c2ccccc2NC(=O)Nc2ccc(OC(F)(F)F)cc2)CC1