Reaction Details
TargetRetinol-binding protein 4
LigandBDBM50019064
Substrate/Competitorn/a
Meas. Tech.ChEMBL_1361118 (CHEMBL3291833)
IC50 3.0±n/a nM
Citation Wang, YConnors, RFan, PWang, XWang, ZLiu, JKayser, FMedina, JCJohnstone, SXu, HThibault, SWalker, NConn, MZhang, YLiu, QGrillo, MPMotani, ACoward, PWang, Z Structure-assisted discovery of the first non-retinoid ligands for Retinol-Binding Protein 4. Bioorg Med Chem Lett24:2885-91 (2014) 
 
Retinol-binding protein 4
Name:Retinol-binding protein 4
Type:Protein
Mol. Mass.:23008.75
Organism:Homo sapiens (Human)
Description:P02753
Residue:201
BDBM50019064
NameBDBM50019064
Synonyms:CHEMBL3288340
TypeSmall organic molecule
Emp. Form.C16H15F3N2OS
Mol. Mass.340.363
SMILESFC(F)(F)c1ccccc1C1CCN(CC1)C(=O)c1nccs1