Reaction Details
TargetHigh affinity nerve growth factor receptor
LigandBDBM50022672
Substrate/Competitorn/a
Meas. Tech.ChEMBL_1368860 (CHEMBL3299482)
Kd 27±n/a nM
Citation Stachel, SJSanders, JMHenze, DARudd, MTSu, HPLi, YNanda, KKEgbertson, MSManley, PJJones, KLBrnardic, EJGreen, AGrobler, JAHanney, BLeitl, MLai, MTMunshi, VMurphy, DRickert, KRiley, DKrasowska-Zoladek, ADaley, CZuck, PKane, SABilodeau, MT Maximizing diversity from a kinase screen: identification of novel and selective pan-Trk inhibitors for chronic pain. J Med Chem57:5800-16 (2014) 
 
High affinity nerve growth factor receptor
Name:High affinity nerve growth factor receptor
Type:n/a
Mol. Mass.:87498.18
Organism:Homo sapiens (Human)
Description:P04629
Residue:796
BDBM50022672
NameBDBM50022672
Synonyms:CHEMBL3298266
TypeSmall organic molecule
Emp. Form.C27H26N8O2
Mol. Mass.494.5477
SMILESCOc1cc(ccc1-n1cnc(C)c1)-c1cn(CC(=O)Nc2cc(nn2-c2ccccc2)C2CC2)nn1