Reaction Details
TargetProteinase-activated receptor 4
LigandBDBM50024255
Substrate/Competitorn/a
Meas. Tech.ChEMBL_1435253 (CHEMBL3390699)
IC50 279±n/a nM
Citation Wen, WYoung, SEDuvernay, MTSchulte, MLNance, KDMelancon, BJEngers, JLocuson, CWWood, MRDaniels, JSWu, WLindsley, CWHamm, HEStauffer, SR Substituted indoles as selective protease activated receptor 4 (PAR-4) antagonists: Discovery and SAR of ML354. Bioorg Med Chem Lett24:4708-13 (2014) 
 
Proteinase-activated receptor 4
Name:Proteinase-activated receptor 4
Type:Protein
Mol. Mass.:41145.16
Organism:Homo sapiens (Human)
Description:Q96RI0
Residue:385
BDBM50024255
NameBDBM50024255
Synonyms:CHEMBL3334944
TypeSmall organic molecule
Emp. Form.C19H21N3O2
Mol. Mass.323.3889
SMILESCCCNCc1c(-c2ccccc2)c2cc(ccc2n1C)[N+]([O-])=O