Reaction Details
TargetPotassium voltage-gated channel subfamily H member 2
LigandBDBM41536
Substrate/Competitorn/a
Meas. Tech.ChEMBL_1474497 (CHEMBL3423786)
IC50 4900±n/a nM
Citation Brodney, MABeck, EMButler, CRBarreiro, GJohnson, EFRiddell, DParris, KNolan, CEFan, YAtchison, KGonzales, CRobshaw, AEDoran, SDBundesmann, MWBuzon, LDutra, JHenegar, KLaChapelle, EHou, XRogers, BNPandit, JLira, RMartinez-Alsina, LMikochik, PMurray, JCOgilvie, KPrice, LSakya, SMYu, AZhang, YO'Neill, BT Utilizing structures of CYP2D6 and BACE1 complexes to reduce risk of drug-drug interactions with a novel series of centrally efficacious BACE1 inhibitors. J Med Chem58:3223-52 (2015) 
 
Potassium voltage-gated channel subfamily H member 2
Name:Potassium voltage-gated channel subfamily H member 2
Type:Multi-pass membrane protein
Mol. Mass.:126672.65
Organism:Homo sapiens (Human)
Description:Q12809
Residue:1159
BDBM41536
NameBDBM41536
Synonyms:US8865706, 15
Typen/a
Emp. Form.C17H18F2N4OS
Mol. Mass.364.413
SMILESCn1cc(cn1)[C@H]1C[C@H]2CSC(N)=N[C@]2(CO1)c1ccc(F)cc1F