Reaction Details
TargetBeta-secretase 1
LigandBDBM148176
Substrate/Competitorn/a
Meas. Tech.ChEMBL_1474435 (CHEMBL3423724)
IC50 6.0±n/a nM
Citation Brodney, MABeck, EMButler, CRBarreiro, GJohnson, EFRiddell, DParris, KNolan, CEFan, YAtchison, KGonzales, CRobshaw, AEDoran, SDBundesmann, MWBuzon, LDutra, JHenegar, KLaChapelle, EHou, XRogers, BNPandit, JLira, RMartinez-Alsina, LMikochik, PMurray, JCOgilvie, KPrice, LSakya, SMYu, AZhang, YO'Neill, BT Utilizing structures of CYP2D6 and BACE1 complexes to reduce risk of drug-drug interactions with a novel series of centrally efficacious BACE1 inhibitors. J Med Chem58:3223-52 (2015) 
 
Beta-secretase 1
Name:Beta-secretase 1
Type:Protein
Mol. Mass.:55755.10
Organism:Homo sapiens (Human)
Description:P56817
Residue:501
BDBM148176
NameBDBM148176
Synonyms:US8962616, 22 | US8962616, 4
TypeSmall organic molecule
Emp. Form.C18H19F2N3O2S
Mol. Mass.379.424
SMILESC[C@H]1SC(N)=N[C@]2(CO[C@H](C[C@@H]12)c1nc(C)co1)c1ccc(F)cc1F