Reaction Details
TargetCytochrome P450 3A4
LigandBDBM50088527
Substrate/Competitorn/a
Meas. Tech.ChEMBL_1492827 (CHEMBL3527957)
Ki 287000±n/a nM
Citation Arico-Muendel, CCBelanger, BBenjamin, DBlanchette, HSCaiazzo, TMCentrella, PADeLorey, JDoyle, EGGradhand, UGriffin, STHill, SLabenski, MTMorgan, BAO'Donovan, GPrasad, KSkinner, STaghizadeh, NThompson, CDWakefield, JWestlin, WWhite, KF Metabolites of PPI-2458, a selective, irreversible inhibitor of methionine aminopeptidase-2: structure determination and in vivo activity. Drug Metab Dispos41:814-26 (2013) 
 
Cytochrome P450 3A4
Name:Cytochrome P450 3A4
Type:Enzyme
Mol. Mass.:57349.57
Organism:Homo sapiens (Human)
Description:n/a
Residue:503
BDBM50088527
NameBDBM50088527
Synonyms:CHEMBL3527358
TypeSmall organic molecule
Emp. Form.C22H36N2O6
Mol. Mass.424.531
SMILES[H][C@@]1([#6@H](-[#8]-[#6])-[#6@@H](-[#6]-[#6][C@]11[#6]-[#8]1)-[#8]-[#6](=O)-[#7]-[#6@H](-[#6](-[#6])-[#6])-[#6](-[#7])=O)[C@@]1([#6])[#8]-[#6@@H]1-[#6]\[#6]=[#6](\[#6])-[#6]