Reaction Details
TargetProto-oncogene tyrosine-protein kinase ROS
LigandBDBM50092080
Substrate/Competitorn/a
Meas. Tech.ChEMBL_1498728 (CHEMBL3583141)
IC50 300±n/a nM
Citation Choi, HSRucker, PVWang, ZFan, YAlbaugh, PChopiuk, GGessier, FSun, FAdrian, FLiu, GHood, TLi, NJia, YChe, JMcCormack, SLi, ALi, JSteffy, ACulazzo, ATompkins, CPhung, VKreusch, ALu, MHu, BChaudhary, APrashad, MTuntland, TLiu, BHarris, JSeidel, HMLoren, JMolteni, V (R)-2-Phenylpyrrolidine Substituted Imidazopyridazines: A New Class of Potent and Selective Pan-TRK Inhibitors. ACS Med Chem Lett6:562-7 (2015) 
 
Proto-oncogene tyrosine-protein kinase ROS
Name:Proto-oncogene tyrosine-protein kinase ROS
Type:Enzyme
Mol. Mass.:263897.39
Organism:Homo sapiens (Human)
Description:P08922
Residue:2347
BDBM50092080
NameBDBM50092080
Synonyms:CHEMBL3582427
TypeSmall organic molecule
Emp. Form.C20H15N5
Mol. Mass.325.3666
SMILESN#Cc1ccc(cc1)-c1cnc2ccc(NCc3ccccc3)nn12